{"text_format":"1","workbook":"xlsx","n_sheets":8,"sheets":["Type marques","Historiq","Circuits","HistoriqCircuits","Familles Plus","Familles Moins","Familles HD","Régions"],"not_rendered":{"charts":4,"images":8,"macros":1,"external_links":2,"defined_names":6,"comments":0,"pivot_tables":0},"unopened":[],"bounds":{"document_bytes":16777216,"sheet_cells":100000,"rows_first":2000,"rows_last":500,"rows_between":2000,"halvings":0,"cell_chars":16384,"cell_head_chars":4096},"cells_cut":0,"cells_raw":0,"read":"whole","date_system":"1900"}

{"sheet":"Type marques","index":0,"n_rows":23,"n_cols":21,"rows_kept":23,"cut":false,"hidden":false,"merged":[[10,1,10,3]]}
["Observatoire des prix et des marges"]
[]
["Produits de grande consommation – Grande distribution",null,null,null,null,null,null,null,null,null,null,null,null,null,null,null,null,"EXHAUSTIF","MDD","PPX","MFAB"]
[null,null,null,null,null,null,null,null,null,null,null,null,null,null,null,null,"Total EPICERIE",-2.38,-0.14000000000000001,1.4,-3.37]
[null,null,null,null,null,null,null,null,null,null,null,null,null,null,null,null,"Total LIQUIDES",-1.46,1.89,0.59,-2.73]
[null,null,null,null,null,null,null,null,null,null,null,null,null,null,null,null,"Total D.P.H.",-2.84,-0.88,-0.21,-3.43]
[null,null,null,null,null,null,null,null,null,null,null,null,null,null,null,null,"Total Produits Frais",-1.25,0.15,0.45,-2.33]
[null,null,null,null,null,null,null,null,null,null,null,null,null,null,null,null,"Total Non Alimentaire",-1.61,-0.74,-1.22,-2.2400000000000002]
[null,null,null,null,null,null,null,null,null,null,null,null,null,null,null,null,"Total P.G.C.",-2.39,-0.04,0.93,-3.3]
[null,null,null,null,null,null,null,null,null,null,null,null,null,null,null,null,"Total Alimentaire",-2.12,0.02,0.79,-3.11]
[null,null,null,null,null,"EXHAUSTIF",null,"MARQUES FABRICANTS",null,"MDD",null,"PPX",null,null,null,null,"Total GENERAL",-2.1,0,0.69,-3.09]
[null," ---EPICERIE",null,null,null,{"$f":"+R4","v":-2.38},null,{"$f":"+U4","v":-3.37},null,{"$f":"+S4","v":-0.14000000000000001},null,{"$f":"+T4","v":1.4}]
[null," ---LIQUIDES",null,null,null,{"$f":"+R5","v":-1.46},null,{"$f":"+U5","v":-2.73},null,{"$f":"+S5","v":1.89},null,{"$f":"+T5","v":0.59}]
[null," ---D.P.H.",null,null,null,{"$f":"+R6","v":-2.84},null,{"$f":"+U6","v":-3.43},null,{"$f":"+S6","v":-0.88},null,{"$f":"+T6","v":-0.21}]
[null," --P.G.C.",null,null,null,{"$f":"+R9","v":-2.39},null,{"$f":"+U9","v":-3.3},null,{"$f":"+S9","v":-0.04},null,{"$f":"+T9","v":0.93}]
{"$rows_left_out":9}
{"sheet":"Historiq","index":1,"n_rows":188,"n_cols":23,"rows_kept":188,"cut":false,"hidden":false,"merged":[]}
["Observatoire des prix et des marges",null,null,null,null,null,null,null,null,null,null,null,null,null,null,null,"Evolution de l'inflation (inflation annuelle 2003/2002, 2004/2003 etc.)"]
[null,null,null,null,null,null,null,null,null,null,null,null,null,null,null,null,"Total circuits - par type de marques, et du Hard-Discount (en exhaustif)"]
["Produits de grande consommation – Grande distribution"]
[null,null,null,null,null,null,null,null,null,null,null,null,null,null,null,null,"TOTAL GENERAL                            "]
[null,null,null,null,null,null,null,null,null,null,null,null,null,null,null,null,null,"Exhaustifs","MdD","Premiers Prix","Mar. Fabricants","Hard-Discounters","MP HD"]
[null,null,null,null,null,null,null,null,null,null,null,null,null,null,null,null,"2003-01-01",2.23,0.45,1.02,null,-0.05,{"$f":"+V6","v":-0.05}]
[null,null,null,null,null,null,null,null,null,null,null,null,null,null,null,null,"février",2.52,0.48,1.02,null,0.05,0.05]
[null,null,null,null,null,null,null,null,null,null,null,null,null,null,null,null,"mars",2.82,0.67,1.18,null,-0.16,-0.16]
[null,null,null,null,null,null,null,null,null,null,null,null,null,null,null,null,"avril",3.06,0.59,1.46,null,-0.15,-0.15]
[null,null,null,null,null,null,null,null,null,null,null,null,null,null,null,null,"mai",3.02,0.67,1.1499999999999999,null,-0.26,-0.26]
[null,null,null,null,null,null,null,null,null,null,null,null,null,null,null,null,"juin",2.9,0.98,0.99,null,-0.63,-0.63]
[null,null,null,null,null,null,null,null,null,null,null,null,null,null,null,null,"sept.",2.12,0.51,0.39,null,-0.73,-0.73]
[null,null,null,null,null,null,null,null,null,null,null,null,null,null,null,null,"octobre",1.98,0.45,-1.2,null,-0.48,-0.48]
[null,null,null,null,null,null,null,null,null,null,null,null,null,null,null,null,"nov.",1.92,0.36,-0.6,null,-1.02,-1.02]
[null,null,null,null,null,null,null,null,null,null,null,null,null,null,null,null,"déc*",1.9,0.215,-0.85,null,-1.0900000000000001,-1.0900000000000001]
{"$rows_left_out":174}
{"sheet":"Circuits","index":2,"n_rows":57,"n_cols":19,"rows_kept":57,"cut":false,"hidden":false,"merged":[]}
["Observatoire des prix et des marges"]
[]
["Produits de grande consommation – Grande distribution"]
[null,null,null,null,null,null,null,null,null,null,null,null,null,null,"Hypers","Supers","H.D.","GMS"]
[null,null,null,null,null,null,null,null,null,null,null,null,null,"Exhaustif",{"$f":"+O9","v":-2.2599999999999998},{"$f":"+O10","v":-1.72},{"$f":"+O11","v":-5.38},{"$f":"+O12","v":-2.1}]
[null,null,null,null,null,null,null,null,null,null,null,null,null,"Marques Fabricants",-3.18,-2.89,-5.35,-3.09]
[]
[null,null,null,null,null,null,null,null,null,null,null,null,null,null,"Exha",null,null,"Mdd","PPx"]
[null,null,null,null,null,null,null,null,null,null,null,null,null,"HM",-2.2599999999999998,-3.18,-0.11,1.07]
[null,null,null,null,null,null,null,null,null,null,null,null,null,"SM",-1.72,-2.89,0.44,0.38]
[null,null,null,null,null,null,null,null,null,null,null,null,null,"HD",-5.38,-5.35,-5.58,-4.5199999999999996]
[null,null,null,null,null,null,null,null,null,null,null,null,null,"TTMAG",-2.1,-3.09,0,0.69]
[]
[]
[]
{"$rows_left_out":43}
{"sheet":"HistoriqCircuits","index":3,"n_rows":120,"n_cols":21,"rows_kept":120,"cut":false,"hidden":false,"merged":[]}
["Observatoire des prix et des marges",null,null,null,null,null,null,null,null,null,null,null,null,null,null,"Evolution de l'INFLATION ANNUELLE par TYPES de CIRCUITS"]
[null,null,null,null,null,null,null,null,null,null,null,null,null,null,null,"pour les Produits PGC+PFLS en Exhaustif"]
["Produits de grande consommation – Grande distribution"]
[null,null,null,null,null,null,null,null,null,null,null,null,null,null,null,"TOTAL GENERAL                            ",null,"Hypers","Supers","Hard-Discount","GMS"]
[null,null,null,null,null,null,null,null,null,null,null,null,null,null,null,null,"Janvier 2005",-1.2E-2,-6.7999999999999996E-3,-1.6299999999999999E-2,-1.01E-2]
[null,null,null,null,null,null,null,null,null,null,null,null,null,null,null,null,"Février 2005",-1.29E-2,-0.01,-1.34E-2,-1.17E-2]
[null,null,null,null,null,null,null,null,null,null,null,null,null,null,null,null,"Mars 2005",-1.4E-2,-1.2500000000000001E-2,-2.12E-2,-1.3299999999999999E-2]
[null,null,null,null,null,null,null,null,null,null,null,null,null,null,null,null,"Avril 2005",-1.46E-2,-1.2E-2,-1.6E-2,-1.34E-2]
[null,null,null,null,null,null,null,null,null,null,null,null,null,null,null,null,"Mai 2005",-1.5800000000000002E-2,-1.34E-2,-1.5800000000000002E-2,-1.47E-2]
[null,null,null,null,null,null,null,null,null,null,null,null,null,null,null,null,"Juin 2005",-1.6500000000000001E-2,-1.3599999999999999E-2,-1.5299999999999999E-2,-1.52E-2]
[null,null,null,null,null,null,null,null,null,null,null,null,null,null,null,null,"Juillet 2005*",-1.21E-2,-1.1766666666666667E-2,-1.5266666666666666E-2,-1.1933333333333332E-2]
[null,null,null,null,null,null,null,null,null,null,null,null,null,null,null,null,"Août 2005*",-7.7000000000000011E-3,-9.9333333333333339E-3,-1.5233333333333333E-2,-8.666666666666668E-3]
[null,null,null,null,null,null,null,null,null,null,null,null,null,null,null,null,"Sept. 2005",-3.3E-3,-8.0999999999999996E-3,-1.52E-2,-5.4000000000000003E-3]
[null,null,null,null,null,null,null,null,null,null,null,null,null,null,null,null,"Oct. 2005",-1E-3,-2.0999999999999999E-3,-1.41E-2,-1.5E-3]
[null,null,null,null,null,null,null,null,null,null,null,null,null,null,null,null,"Nov. 2005",-4.0000000000000002E-4,-4.1999999999999997E-3,-1.12E-2,-2.0999999999999999E-3]
{"$rows_left_out":106}
{"sheet":"Familles Plus","index":4,"n_rows":100,"n_cols":28,"rows_kept":100,"cut":false,"hidden":false,"merged":[[11,1,11,3]]}
["Observatoire des prix et des marges",null,null,null,null,null,null,null,null,null,null,null,null,null,null,null,null,null,null,null,null,null,"grprd","Fam/ray","Exhaustif","MDD","PPX","mfab"]
[null,null,null,null,null,null,null,null,null,null,null,null,null,null,null,null,null,null,null,null,null,null,"FA00018","Fruits secs, pruneaux",2.5299999999999998,2.77,8,{"$f":"VLOOKUP(W2,[2]Feuil1!$A$1:$G$65536,7,0)","v":1.94}]
["Produits de grande consommation – Grande distribution",null,null,null,null,null,null,null,null,null,null,null,null,null,null,null,null,null,"EXHAUSTIF","MDD","PPX","MFAB","FA00098","Traitements, engrais plant",1.22,2.41,9.5,{"$f":"VLOOKUP(W3,[2]Feuil1!$A$1:$G$65536,7,0)","v":0.68}]
[null,null,null,null,null,null,null,null,null,null,null,null,null,null,null,null,null,null,null,null,null,null,"FA00046","Digestif,liqueur,eau de vie",1.18,2.5299999999999998,-0.8,{"$f":"VLOOKUP(W4,[2]Feuil1!$A$1:$G$65536,7,0)","v":0.69}]
[null,null,null,null,null,null,null,null,null,null,null,null,null,null,null,null,null,"Fruits secs, pruneaux",2.5299999999999998,2.77,8,1.94,"FA00043","Cidre, cider",1.08,4.37,0.06,{"$f":"VLOOKUP(W5,[2]Feuil1!$A$1:$G$65536,7,0)","v":-0.34}]
[null,null,null,null,null,null,null,null,null,null,null,null,null,null,null,null,null,"Traitements, engrais plant",1.22,2.41,9.5,0.68,"FA00002","Paté,rillet,sciss,foie gras",1.05,4.09,0.39,{"$f":"VLOOKUP(W6,[2]Feuil1!$A$1:$G$65536,7,0)","v":-0.35}]
[null,null,null,null,null,null,null,null,null,null,null,null,null,null,null,null,null,"Digestif,liqueur,eau de vie",1.18,2.5299999999999998,-0.8,0.69,"FA00044","Vin (Table et Pays)",1.05,3.53,2.4500000000000002,{"$f":"VLOOKUP(W7,[2]Feuil1!$A$1:$G$65536,7,0)","v":-0.4}]
[null,null,null,null,null,null,null,null,null,null,null,null,null,null,null,null,null,"Cidre, cider",1.08,4.37,0.06,-0.34,"FA00048","Apéritifs alcoolisés",0.96,2.1,1.51,{"$f":"VLOOKUP(W8,[2]Feuil1!$A$1:$G$65536,7,0)","v":0.56999999999999995}]
[null,null,null,null,null,null,null,null,null,null,null,null,null,null,null,null,null,"Paté,rillet,sciss,foie gras",1.05,4.09,0.39,-0.35,"FA00045","Champagne, mousseux",0.51,1.72,2.19,{"$f":"VLOOKUP(W9,[2]Feuil1!$A$1:$G$65536,7,0)","v":-0.04}]
[null,null,null,null,null,null,null,null,null,null,null,null,null,null,null,null,null,"Vin (Table et Pays)",1.05,3.53,2.4500000000000002,-0.4,"FA00085","Saurisserie",0.49,1.64,0.26,{"$f":"VLOOKUP(W10,[2]Feuil1!$A$1:$G$65536,7,0)","v":-0.46}]
[null,null,null,null,null,null,null,null,null,null,null,null,null,null,null,null,null,"Apéritifs alcoolisés",0.96,2.1,1.51,0.56999999999999995,"FA00081","FRUITS MER, POISSON NAT, PANES, GRENOUILLE ESCARGOT",0.42,1.91,2.09,{"$f":"VLOOKUP(W11,[2]Feuil1!$A$1:$G$65536,7,0)","v":-1.97}]
[null,null,null,null,null,"EXHAUSTIF",null,"MARQUES FABRICANTS",null,"MDD",null,"PPX",null,null,null,null,null,"Champagne, mousseux",0.51,1.72,2.19,-0.04,"FA00080","Plats cuisinés tt prêt surg",0.28000000000000003,1.33,1.37,{"$f":"VLOOKUP(W12,[2]Feuil1!$A$1:$G$65536,7,0)","v":-1.62}]
[null,{"$f":"+R5","v":"Fruits secs, pruneaux"},null,null,null,{"$f":"+S5","v":2.5299999999999998},null,1.94,null,{"$f":"+T5","v":2.77},null,{"$f":"+U5","v":8},null,null,null,null,null,"Saurisserie",0.49,1.64,0.26,-0.46,"FA00005","Légumes secs et deshydratés",0.09,-1.02,8.15,{"$f":"VLOOKUP(W13,[2]Feuil1!$A$1:$G$65536,7,0)","v":0.4}]
[null,"Traitements, engrais plant",null,null,null,1.22,null,0.68,null,2.41,null,9.5,null,null,null,null,null,"Fruits mer, poisson nat, panes, grenouille escargot",0.42,1.91,2.09,-1.97,"FA00079","Entrée,pizza,fast food surg",0.09,1.75,-0.5,{"$f":"VLOOKUP(W14,[2]Feuil1!$A$1:$G$65536,7,0)","v":-1.59}]
[null,"Digestif,liqueur,eau de vie",null,null,null,1.18,null,0.69,null,2.5299999999999998,null,-0.8,null,null,null,null,null,null,null,null,null,null,"FA00078","Fromages",0.05,1.07,1.97,{"$f":"VLOOKUP(W15,[2]Feuil1!$A$1:$G$65536,7,0)","v":-0.56999999999999995}]
{"$rows_left_out":86}
{"sheet":"Familles Moins","index":5,"n_rows":100,"n_cols":28,"rows_kept":100,"cut":false,"hidden":false,"merged":[[13,1,13,3]]}
["Observatoire des prix et des marges",null,null,null,null,null,null,null,null,null,null,null,null,null,null,null,null,null,null,null,null,null,"grprd","Fam/ray","Exhaustif","MDD","PPX","mfab"]
[null,null,null,null,null,null,null,null,null,null,null,null,null,null,null,null,null,null,null,null,null,null,"FA00038","Eaux",-6.22,0.98,-0.69,{"$f":"VLOOKUP(W2,[2]Feuil1!$A$1:$G$65536,7,0)","v":-8.09}]
["Produits de grande consommation – Grande distribution",null,null,null,null,null,null,null,null,null,null,null,null,null,null,null,null,null,"EXHAUSTIF","MDD","PPX","MFAB","FA00088","Panification industr fraIc",-5.57,-2.86,-2.0299999999999998,{"$f":"VLOOKUP(W3,[2]Feuil1!$A$1:$G$65536,7,0)","v":-7.4}]
[null,null,null,null,null,null,null,null,null,null,null,null,null,null,null,null,null,null,null,null,null,null,"FA00016","Aliments infantiles",-5.51,-2.67,null,{"$f":"VLOOKUP(W4,[2]Feuil1!$A$1:$G$65536,7,0)","v":-5.8}]
[null,null,null,null,null,null,null,null,null,null,null,null,null,null,null,null,null,"Eaux",-6.22,0.98,-0.69,-8.09,"FA00093","Petit électroménager",-4.45,-4.8899999999999997,-3.49,{"$f":"VLOOKUP(W5,[2]Feuil1!$A$1:$G$65536,7,0)","v":-4.42}]
[null,null,null,null,null,null,null,null,null,null,null,null,null,null,null,null,null,"Panification industr fraIc",-5.57,-2.86,-2.0299999999999998,-7.4,"FA00024","Lait poudre,concentré adult",-4.3099999999999996,-1.47,-5.45,{"$f":"VLOOKUP(W6,[2]Feuil1!$A$1:$G$65536,7,0)","v":-4.82}]
[null,null,null,null,null,null,null,null,null,null,null,null,null,null,null,null,null,"Aliments infantiles",-5.51,-2.67,null,-5.8,"FA00056","Produits capillaires",-4.1100000000000003,-0.48,1.0900000000000001,{"$f":"VLOOKUP(W7,[2]Feuil1!$A$1:$G$65536,7,0)","v":-4.67}]
[null,null,null,null,null,null,null,null,null,null,null,null,null,null,null,null,null,"Petit électroménager",-4.45,-4.8899999999999997,-3.49,-4.42,"FA00051","Déodorant,parfum,edt adu+bb",-4.0999999999999996,-6.49,-0.19,{"$f":"VLOOKUP(W8,[2]Feuil1!$A$1:$G$65536,7,0)","v":-3.88}]
[null,null,null,null,null,null,null,null,null,null,null,null,null,null,null,null,null,"Lait poudre,concentré adult",-4.3099999999999996,-1.47,-5.45,-4.82,"FA00037","Chewing gum",-3.88,5.56,0.02,{"$f":"VLOOKUP(W9,[2]Feuil1!$A$1:$G$65536,7,0)","v":-4.03}]
[null,null,null,null,null,null,null,null,null,null,null,null,null,null,null,null,null,"Produits capillaires",-4.1100000000000003,-0.48,1.0900000000000001,-4.67,"FA00091","GANTS DE MENAGE JETABLES",-3.88,-1.01,-14.31,{"$f":"VLOOKUP(W10,[2]Feuil1!$A$1:$G$65536,7,0)","v":-5.55}]
[null,null,null,null,null,null,null,null,null,null,null,null,null,null,null,null,null,"Déodorant,parfum,edt adu+bb",-4.0999999999999996,-6.49,-0.19,-3.88,"FA00030","Café torréfié",-3.73,-1.91,-0.85,{"$f":"VLOOKUP(W11,[2]Feuil1!$A$1:$G$65536,7,0)","v":-4.34}]
[null,null,null,null,null,null,null,null,null,null,null,null,null,null,null,null,null,"Chewing gum",-3.88,5.56,0.02,-4.03,"FA00055","Hygiène dentaire",-3.66,-1.37,0.33,{"$f":"VLOOKUP(W12,[2]Feuil1!$A$1:$G$65536,7,0)","v":-4.09}]
[null,null,null,null,null,null,null,null,null,null,null,null,null,null,null,null,null,"Gants de ménage jetables",-3.88,-1.01,-14.31,-5.55,"FA00017","Produits diététiques",-3.57,-1.62,4.74,{"$f":"VLOOKUP(W13,[2]Feuil1!$A$1:$G$65536,7,0)","v":-3.78}]
[null,null,null,null,null,"EXHAUSTIF",null,"MARQUES FABRICANTS",null,"MDD",null,"PPX",null,null,null,null,null,"Café torréfié",-3.73,-1.91,-0.85,-4.34,"FA00061","Mouchoirs papier, lingettes",-3.57,-2.17,-1.59,{"$f":"VLOOKUP(W14,[2]Feuil1!$A$1:$G$65536,7,0)","v":-4.6500000000000004}]
[null,{"$f":"+R5","v":"Eaux"},null,null,null,{"$f":"+S5","v":-6.22},null,-8.09,null,{"$f":"+T5","v":0.98},null,{"$f":"+U5","v":-0.69},null,null,null,null,null,null,null,null,null,null,"FA00023","Panification sèche",-3.53,-0.49,0.08,{"$f":"VLOOKUP(W15,[2]Feuil1!$A$1:$G$65536,7,0)","v":-5.2}]
{"$rows_left_out":86}
{"sheet":"Familles HD","index":6,"n_rows":93,"n_cols":30,"rows_kept":93,"cut":false,"hidden":false,"merged":[[10,1,10,3],[10,10,10,12]]}
["Observatoire des prix et des marges",null,null,null,null,null,null,null,null,null,null,null,null,null,null,null,null,null,null,null,null,null,null,null,null,null,"grprd","Fam/ray","Exhaustif","MP Hard-Discount"]
[null,null,null,null,null,null,null,null,null,null,null,null,null,null,null,null,null,null,null,null,null,null,null,null,null,null,"FA00061","Mouchoirs papier, lingettes",-16.36,-17.043820598006647]
["Produits de grande consommation – Grande distribution",null,null,null,null,null,null,null,null,null,null,null,null,null,null,null,null,null,null,null,null,null,"EXHAUSTIF","Marques Propres",null,null,"FA00051","Déodorant,parfum,edt adu+bb",-13.89,-23.034858096828046]
[null,null,null,null,null,null,null,null,null,null,null,null,null,null,null,null,null,null,null,null,null,"Cidre, cider",2.89,13.483333333333333,null,null,"FA00016","Aliments infantiles",-12.37,-11.27217857142857]
[null,null,null,null,null,null,null,null,null,null,null,null,null,null,null,null,null,null,null,null,null,"Vin (Table et Pays)",1.17,-0.5886301369863014,null,null,"FA00060","Coton",-12.33,-14.165747126436781]
[null,null,null,null,null,null,null,null,null,null,null,null,null,null,null,null,null,null,null,null,null,"Sirop,concent,poudre boiss",0.36,1.1649779735682819,null,null,"FA00096","LITIERES POUR ANIMAUX",-11.51,-11.927639751552796]
[null,null,null,null,null,null,null,null,null,null,null,null,null,null,null,null,null,null,null,null,null,"Huile moteur",-0.08,-0.08,null,null,"FA00077","Oeufs",-11.43,-12.088565022421523]
[null,null,null,null,null,null,null,null,null,null,null,null,null,null,null,null,null,null,null,null,null,"Fruits au sirop, au jus",-0.38,-0.44797101449275362,null,null,"FA00056","Produits capillaires",-10.54,-12.038178137651821]
[null,null,null,null,null,null,null,null,null,null,null,null,null,null,null,null,null,null,null,null,null,"Désodorisants d'intérieur",-1.19,-2.7259022556390975,null,null,"FA00052","Soins corps, visage adu+bb",-10.34,-20.330615384615385]
[null,null,null,null,null,null,null,null,null,null,null,null,null,null,null,null,null,null,null,null,null,"Maquillage",-1.48,-20.82,null,null,"FA00062","Papier hygiénique",-9.99,-10.746060606060606]
[null,null,null,null,null,"EXHAUSTIF",null,"Marques Propres",null,null,null,null,null,null,"EXHAUSTIF",null,"Marques Propres",null,null,null,null,"Légumes vinaig, huile, saum",-1.55,-0.69845854922279793,null,null,"FA00015","Aliments chiens et chats",-9.17,-8.8865228826933205]
[null,{"$f":"+V4","v":"Cidre, cider"},null,null,null,{"$f":"+W4","v":2.89},null,{"$f":"+X4","v":13.483333333333333},null,null,{"$f":"+V20","v":"Mouchoirs papier, lingettes"},null,null,null,{"$f":"+W20","v":-16.36},null,{"$f":"+X20","v":-17.043820598006647},null,null,null,null,"Panification sèche",-1.6,-1.3864587973273941,null,null,"FA00320","Changes complets, couches,culottes absorbantes bebes",-9.0399999999999991,-9.2412499999999991]
[null,"Vin (Table et Pays)",null,null,null,1.17,null,-0.5886301369863014,null,null,"Déodorant,parfum,edt adu+bb",null,null,null,-13.89,null,-23.034858096828046,null,null,null,null,"FRUITS MER, POISSON NAT, PANES, GRENOUILLE ESCARGOT",-1.61,-2.7039440203562339,null,null,"FA00066","Eponges, tampons A récurer",-8.85,-7.4832492113564673]
[null,"Sirop,concent,poudre boiss",null,null,null,0.36,null,1.1649779735682819,null,null,"Aliments infantiles",null,null,null,-12.37,null,-11.27217857142857,null,null,null,null,null,null,null,null,null,"FA00070","Cirage, entret,teintu cuir",-8.76,-10.68]
[null,"Huile moteur",null,null,null,-0.08,null,-0.08,null,null,"Coton",null,null,null,-12.33,null,-14.165747126436781,null,null,null,null,null,null,null,null,null,"FA00024","Lait poudre,concentré adult",-8.5399999999999991,-10.736353591160221]
{"$rows_left_out":79}
{"sheet":"Régions","index":7,"n_rows":33,"n_cols":7,"rows_kept":33,"cut":false,"hidden":false,"merged":[[32,3,32,5],[25,3,25,5],[26,3,26,5],[27,3,27,5],[28,3,28,5],[31,3,31,5],[29,3,29,5],[30,3,30,5],[11,3,11,5],[12,3,12,5],[19,3,19,5],[16,3,16,5],[17,3,17,5],[18,3,18,5],[24,3,24,5],[23,3,23,5],[13,3,13,5],[14,3,14,5],[15,3,15,5],[22,3,22,5],[21,3,21,5],[20,3,20,5]]}
["Observatoire des prix et des marges"]
[]
["Produits de grande consommation – Grande distribution"]
[]
[]
[]
[]
[]
[]
[]
[]
["A0",null,null,"Alsace",null,null,-1.96]
["A1",null,null,"Aquitaine",null,null,-1.83]
["A2",null,null,"Auvergne",null,null,-2.14]
["A3",null,null,"Basse-Normandie",null,null,-1.52]
{"$rows_left_out":18}